ADC,ID,VISITNUM,VISITDATE,MOFROMINDEX,Diagnosis,DX,DX_AD,Mix_AD,Mix_DLB,Mix_FTD,Mix_VaD,SEX,AGE,AGEDEATH,DEATHDATE,BMI,NIHR,DIABETES,HYPERTEN,HYPERCHO,BPSYS,BPDIAS,HRATE,SMOKYRS,CDRSUM,MMSE,DIED,SURVIVAL_TIME,Ch2,Ch3,Ch4,Ch5,Ch6,Ch7,Ch8,Ch9,Ch10,Ch11,Ch12
289,385,1,11/08/2006,0,AD,1,1,,,,,1,80,,,,1,0,0,1,,,,15,5.0,24,1,105,0,0,0,0,0,0,1,0,0,0,0
289,385,2,03/19/2008,16,AD,1,1,,,,,1,82,,,29.0,1,0,1,1,160,80,68,20,7.0,22,,,0,0,1,1,1,0,0,1,0,0,1
289,385,3,03/04/2009,28,AD,1,1,,,,,1,83,,,29.0,1,0,0,1,,,72,17,5.0,21,,,0,0,1,1,1,0,0,1,0,0,1
289,385,4,04/21/2010,41,AD,1,1,,,,,1,84,,,26.4,1,0,0,0,166,86,86,17,5.0,20,,,0,0,1,1,1,0,0,1,0,0,1
289,385,5,01/28/2011,50,AD,1,1,,,,,1,84,,,29.0,1,0,0,0,135,81,74,20,7.0,16,,,0,0,1,1,1,0,0,1,0,0,1
289,1095,1,10/18/2016,0,AD,1,1,1,1,0,0,2,49,,,18.7,1,0,0,0,123,56,77,0,6.0,,,,0,0,0,0,0,1,0,0,0,0,0
289,1118,1,05/14/2014,0,VaD,4,0,0,0,0,1,2,71,,,23.9,5,0,1,1,140,90,72,0,1.5,,,,0,0,0,0,0,1,0,0,0,0,0
289,2326,1,01/18/2006,0,Normal,8,0,,,,,1,63,,,,1,0,0,1,,,,,0.0,30,0,17,0,0,0,0,0,0,1,0,0,0,0
289,2373,1,02/09/2017,0,AD,1,1,1,0,0,0,1,83,,,21.1,1,0,1,1,174,73,55,0,3.5,,,,0,0,0,0,0,1,0,0,0,0,0
289,4056,1,01/07/2009,0,Normal,8,0,,,,,2,47,,,,5,0,0,0,156,80,84,0,0.0,,0,52,0,0,0,0,0,0,1,0,0,0,0
289,4056,2,01/27/2010,12,Normal,8,0,,,,,2,48,,,33.5,5,0,0,0,129,85,72,0,0.0,,,,0,0,1,1,1,0,0,1,0,0,0
289,4056,3,01/07/2011,24,Normal,8,0,,,,,2,49,,,33.2,5,0,1,0,146,81,68,0,0.0,,,,0,0,1,1,1,0,0,1,0,0,0
289,4056,4,03/05/2012,38,Normal,8,0,,,,,2,51,,,33.2,5,0,1,0,154,98,78,0,0.0,,,,0,0,1,1,1,0,0,1,0,0,0
289,4056,5,05/24/2013,52,Normal,8,0,,,,,2,52,,,32.8,5,0,1,0,120,70,64,0,0.0,30,,,0,0,1,1,1,0,0,1,0,0,0
289,5505,1,03/11/2013,0,FTD,3,0,0,0,1,0,2,52,,,31.9,1,0,1,1,166,87,75,0,8.0,14,,,0,0,0,0,0,1,0,0,0,0,0
289,7242,1,06/28/2006,0,FTD,3,0,,,,,1,60,,,,1,0,0,0,140,70,,0,5.0,28,1,66,0,0,0,0,0,0,1,0,0,0,0
289,8297,1,02/02/2015,0,FTD,3,0,0,0,1,0,1,73,,,28.2,1,0,0,1,130,90,78,50,5.5,24,,,0,0,0,0,0,1,0,0,0,0,0
289,9523,1,09/18/2012,0,AD,1,1,1,0,0,0,1,83,86,08/15/2014,22.2,1,1,1,0,142,60,54,30,4.5,16,,,1,0,0,0,0,1,0,0,1,0,0
289,11037,1,10/15/2008,0,AD,1,1,,,,,1,78,,,24.4,1,0,0,1,130,78,52,13,3.0,25,0,13,0,0,0,0,0,0,1,0,0,0,0
289,11361,1,04/18/2006,0,FTD,3,0,,,,,1,58,,,27.8,1,0,0,0,137,85,64,0,6.0,14,1,33,0,0,1,0,0,0,1,0,0,0,1
289,11361,2,06/26/2007,14,FTD,3,0,,,,,1,59,,,27.8,1,0,0,0,125,78,76,0,9.0,13,,,0,0,1,0,0,0,0,0,0,0,1
289,13195,1,03/05/2012,0,FTD,3,0,,,,,2,73,,,,1,0,0,1,145,67,69,35,1.0,25,0,40,0,0,0,0,0,0,1,0,0,0,0
289,13277,1,10/01/2014,0,FTD,3,0,0,0,1,0,1,48,,,25.8,1,0,0,0,118,68,68,0,9.0,26,,,0,0,0,0,0,1,0,0,0,0,0
289,13442,1,01/14/2013,0,FTD,3,0,0,0,1,0,2,67,,,23.9,1,0,0,0,117,59,80,2,6.5,23,,,0,0,0,0,0,1,0,0,0,0,0
289,16121,1,03/21/2011,0,FTD,3,0,0,0,1,0,2,73,,,18.7,1,0,0,0,172,76,64,12,2.0,,,,0,0,0,0,0,1,0,0,0,0,0
289,16218,1,06/19/2006,0,FTD,3,0,,,,,2,70,,,20.1,3,0,0,0,126,67,72,0,0.0,28,1,57,0,0,1,0,0,0,1,0,0,0,1
289,16218,2,08/14/2007,14,FTD,3,0,,,,,2,71,,,18.1,3,0,0,1,122,58,60,0,0.5,23,,,0,0,1,0,0,0,0,0,0,0,1
289,16341,1,07/22/2015,0,VaD,4,0,0,0,0,1,1,78,,,28.1,1,0,1,1,150,95,66,0,0.5,,,,0,0,0,0,0,1,0,0,0,0,0
289,17834,1,06/26/2015,0,AD,1,1,,,,,1,76,,,31.6,1,0,1,1,130,76,60,15,2.5,,0,12,0,0,0,0,0,0,1,0,0,0,0
289,18152,1,01/18/2013,0,Normal,8,0,,,,,1,76,77,09/15/2013,20.8,1,0,1,1,140,80,76,26,0.5,29,,,1,0,0,0,0,0,0,0,1,0,0
289,19700,1,07/15/2009,0,Normal,8,0,,,,,1,49,,,29.2,5,0,0,0,140,100,72,0,0.0,,0,41,0,0,1,1,1,0,1,1,0,0,0
289,19700,2,10/08/2010,15,Normal,8,0,,,,,1,50,,,24.4,5,0,0,0,128,87,75,0,0.0,30,,,0,0,1,1,1,0,0,1,0,0,0
289,19700,3,09/09/2011,26,Normal,8,0,,,,,1,51,,,26.1,5,0,0,0,113,74,93,0,0.0,,,,0,0,1,1,1,0,0,1,0,0,0
289,19700,4,12/07/2012,41,Normal,8,0,,,,,1,52,,,25.4,5,0,1,0,123,85,72,0,0.0,,,,0,0,1,1,1,0,0,1,0,0,0
289,19843,1,09/06/2007,0,FTD,3,0,0,0,1,0,1,57,,,25.6,1,0,0,0,103,71,57,0,7.0,24,,,0,0,0,0,0,1,0,0,0,0,0
289,20020,1,10/08/2007,0,Normal,8,0,,,,,2,63,,,19.6,1,0,0,1,142,66,64,14,0.0,30,0,26,0,0,1,0,0,0,1,0,0,0,1
289,20020,2,12/09/2009,26,Normal,8,0,,,,,2,65,,,19.9,1,0,0,0,146,70,67,15,0.0,28,,,0,0,1,0,0,0,0,0,0,0,1
289,20313,1,08/03/2015,0,Normal,8,0,,,,,1,50,,,28.6,1,0,0,0,130,70,60,23,0.0,,0,17,0,0,0,0,0,0,1,0,0,0,0
289,22385,1,01/05/2015,0,FTD,3,0,,,,,2,61,,,22.3,1,0,0,0,108,78,54,26,3.5,24,0,24,0,0,0,0,0,0,1,0,0,0,0
289,26192,1,05/20/2015,0,Normal,8,0,,,,,1,29,,,,1,0,0,0,,,,0,0.0,,0,16,0,0,0,0,0,0,1,0,0,0,0
289,26302,1,07/09/2015,0,Normal,8,0,,,,,2,59,,,,1,0,1,1,158,110,80,0,0.0,,0,16,0,0,0,0,0,0,1,0,0,0,0
289,26796,1,08/25/2009,0,Normal,8,0,,,,,1,61,,,31.9,1,0,1,1,119,77,65,0,0.0,29,0,13,0,0,1,0,0,0,1,0,0,0,1
289,26796,2,09/08/2010,13,Normal,8,0,,,,,1,62,,,30.7,1,0,1,1,102,64,63,0,0.5,29,,,0,0,1,0,0,0,0,0,0,0,1
289,30525,1,04/09/2007,0,FTD,3,0,,,,,1,57,,,,1,0,0,1,135,72,77,5,2.0,27,1,76,0,0,0,0,0,0,1,0,0,0,0
289,30525,2,05/20/2008,13,FTD,3,0,,,,,1,58,,,26.7,1,0,0,1,,,72,5,4.5,26,,,0,0,1,0,0,0,0,0,0,0,1
289,30525,3,02/22/2010,34,FTD,3,0,,,,,1,59,,,23.1,1,0,0,0,,,99,5,5.5,23,,,0,0,1,0,0,0,0,0,0,0,1
289,31269,1,06/06/2016,0,AD,1,1,1,0,0,0,2,76,,,21.1,1,0,0,0,146,72,52,0,4.5,,,,0,0,0,0,0,1,0,0,0,0,0
289,31565,1,01/22/2013,0,FTD,3,0,,,,,2,73,,,,1,0,1,0,120,60,60,0,6.5,12,0,36,0,0,0,0,0,0,1,0,0,0,0
289,31822,1,10/02/2008,0,Normal,8,0,,,,,1,68,,,27.1,1,0,0,1,130,80,72,0,0.0,29,0,97,0,0,1,1,1,0,1,0,0,0,1
289,31822,2,10/15/2010,24,Normal,8,0,,,,,1,70,,,26.4,1,0,0,1,,,,0,0.0,29,,,0,0,1,1,1,0,0,0,0,0,0
289,31822,3,10/05/2011,36,Normal,8,0,,,,,1,71,,,27.8,1,0,0,1,120,72,64,0,0.0,29,,,0,0,1,1,1,0,0,0,0,0,1
289,31822,4,09/27/2012,47,Normal,8,0,,,,,1,72,,,27.8,1,0,0,1,145,90,59,0,0.0,28,,,0,0,1,1,1,0,0,0,0,0,1
289,31822,5,10/08/2013,60,Normal,8,0,,,,,1,73,,,26.4,1,0,0,1,140,70,56,0,0.0,29,,,0,0,1,1,1,0,0,0,0,0,1
289,31822,6,12/23/2014,74,Normal,8,0,,,,,1,74,,,27.1,1,0,0,1,140,60,72,0,0.0,27,,,0,0,1,1,1,0,0,0,0,0,1
289,31970,1,05/26/2010,0,AD,1,1,,,,,2,82,,,31.4,1,0,1,0,143,66,67,0,8.0,24,0,13,0,0,1,0,0,0,1,0,0,0,1
289,31970,2,06/22/2011,13,AD,1,1,,,,,2,83,,,34.4,1,0,1,0,195,84,65,0,9.0,22,,,0,0,1,0,0,0,0,0,0,0,1
289,32749,1,10/11/2013,0,AD,1,1,,,,,2,59,,,30.6,1,0,1,1,145,88,60,13,9.0,18,0,26,0,0,0,0,0,0,1,0,0,0,0
289,32922,1,09/10/2008,0,AD,1,1,1,0,0,0,2,78,,,23.8,1,0,0,1,120,80,70,0,1.0,24,,,0,0,0,0,0,1,0,0,0,0,0
289,33049,1,09/16/2013,0,FTD,3,0,,,,,1,71,,,28.6,1,0,0,1,118,79,54,0,2.0,30,0,28,0,0,1,0,0,0,1,0,0,0,1
289,33049,2,11/12/2014,14,FTD,3,0,,,,,1,72,,,29.3,1,0,0,1,145,87,60,0,2.0,30,,,0,0,1,0,0,0,0,0,0,0,1
289,34917,1,05/14/2007,0,FTD,3,0,,,,,1,57,,,,1,0,0,1,,,,0,3.5,28,1,93,0,0,0,0,0,0,1,0,0,0,0
289,35219,1,02/04/2008,0,AD,1,1,,,,,2,61,68,06/15/2014,22.3,1,0,0,0,109,67,60,0,6.0,27,1,76,1,0,1,0,0,0,1,0,1,0,1
289,35219,2,02/02/2009,12,AD,1,1,,,,,2,62,,,18.6,1,0,0,0,117,64,64,0,10.0,14,,,0,0,1,0,0,0,0,0,0,0,1
289,35493,1,02/22/2008,0,Normal,8,0,,,,,2,65,,,24.7,1,0,0,0,,,,10,0.0,29,0,27,0,0,0,0,0,0,1,0,0,0,0
289,36218,1,07/16/2014,0,AD,1,1,,,,,2,78,,,21.6,1,0,0,0,104,70,64,0,3.0,20,0,26,0,0,0,0,0,0,1,0,0,0,0
289,36672,1,05/09/2016,0,FTD,3,0,0,0,1,0,2,56,,,24.3,1,0,0,0,123,70,50,0,0.0,,,,0,0,0,0,0,1,0,0,0,0,0
289,36764,1,12/16/2009,0,Normal,8,0,,,,,1,61,,,21.0,1,0,0,0,162,88,67,31,0.0,30,0,12,0,0,1,0,0,0,1,0,0,0,1
289,36764,2,12/17/2010,12,Normal,8,0,,,,,1,62,,,21.0,1,0,0,0,148,87,63,31,0.0,30,,,0,0,1,0,0,0,0,0,0,0,1
289,37512,1,11/28/2007,0,Normal,8,0,,,,,1,67,,,21.5,1,0,1,0,150,88,,30,0.0,30,0,86,0,0,1,1,1,0,1,0,0,0,0
289,37512,2,12/12/2008,13,Normal,8,0,,,,,1,68,,,20.7,1,0,1,0,130,80,60,30,0.0,30,,,0,0,1,1,1,0,0,0,0,0,1
289,37512,3,12/09/2009,25,Normal,8,0,,,,,1,69,,,21.0,1,0,1,0,124,72,64,30,0.0,30,,,0,0,1,1,1,0,0,0,0,0,1
289,37512,4,12/17/2010,37,Normal,8,0,,,,,1,70,,,20.9,1,0,1,0,126,68,68,30,0.0,30,,,0,0,1,1,1,0,0,0,0,0,1
289,37512,5,12/19/2011,49,Normal,8,0,,,,,1,71,,,21.3,1,0,1,0,156,84,61,30,0.0,30,,,0,0,1,1,1,0,0,0,0,0,1
289,37512,6,12/05/2012,61,Normal,8,0,,,,,1,72,,,21.0,1,0,1,0,132,74,76,30,0.0,30,,,0,0,1,1,1,0,0,0,0,0,1
289,37512,8,01/29/2015,86,Normal,8,0,,,,,1,75,,,21.4,1,0,1,0,135,75,60,30,0.0,30,,,0,0,1,1,1,0,0,0,0,0,1
289,38300,1,07/11/2011,0,FTD,3,0,0,0,1,0,2,63,,,23.4,5,0,0,1,111,62,61,0,10.0,19,,,0,0,0,0,0,1,0,0,0,0,0
289,38334,1,09/20/2006,0,Normal,8,0,,,,,2,74,,,22.8,1,0,0,1,114,73,73,0,0.0,30,0,49,0,0,1,1,1,0,1,1,0,0,1
289,38334,3,10/24/2008,25,Normal,8,0,,,,,2,77,,,22.5,1,0,0,0,114,68,72,0,0.0,30,,,0,0,1,1,1,0,0,1,0,0,1
289,38334,4,10/19/2009,37,Normal,8,0,,,,,2,78,,,22.3,1,0,0,1,110,60,84,0,0.0,30,,,0,0,1,1,1,0,0,1,0,0,1
289,38334,5,10/01/2010,49,Normal,8,0,,,,,2,79,,,22.8,1,0,0,1,116,64,64,0,0.0,30,,,0,0,1,1,1,0,0,1,0,0,1
289,38904,1,05/30/2007,0,Normal,8,0,,,,,2,75,,,22.4,1,0,1,1,145,90,57,10,0.0,30,0,22,0,0,1,0,0,0,1,0,0,0,1
289,38904,2,03/04/2009,22,Normal,8,0,,,,,2,77,,,21.6,1,0,1,1,140,80,54,10,0.0,30,,,0,0,1,0,0,0,0,0,0,0,1
289,40968,1,07/05/2011,0,AD,1,1,,,,,1,76,,,20.7,1,0,0,0,142,75,55,0,2.5,24,0,61,0,0,1,0,0,0,1,0,0,0,1
289,40968,2,10/31/2012,15,AD,1,1,,,,,1,77,,,20.5,1,0,0,0,105,55,54,0,3.5,27,,,0,0,1,0,0,0,0,0,0,0,1
289,40968,3,08/27/2013,25,AD,1,1,,,,,1,78,,,21.6,1,0,0,0,98,50,60,0,6.0,26,,,0,0,1,0,0,0,0,0,0,0,1
289,41527,1,06/13/2007,0,FTD,3,0,,,,,1,61,,,22.3,1,0,0,0,110,65,64,40,9.0,14,0,49,0,0,1,0,0,0,1,0,0,0,1
289,41527,2,07/18/2011,49,FTD,3,0,,,,,1,65,,,27.1,1,1,0,1,126,65,61,30,15.0,16,,,0,0,1,0,0,0,0,0,0,0,1
289,42723,1,11/09/2012,0,AD,1,1,1,0,0,0,2,72,73,12/15/2013,18.3,1,0,0,0,145,75,66,0,8.0,17,,,1,0,0,0,0,1,0,0,1,0,0
289,43703,1,06/10/2013,0,AD,1,1,1,0,0,0,2,68,,,26.9,1,0,0,0,134,65,51,0,2.0,18,,,0,0,0,0,0,1,0,0,0,0,0
289,43758,1,04/30/2015,0,DLB,2,0,0,1,0,0,1,65,,,24.6,1,0,1,0,118,70,52,5,3.0,,,,0,0,0,0,0,1,0,0,0,0,0
289,44350,1,02/14/2007,0,Normal,8,0,,,,,2,60,,,24.6,1,0,0,0,110,80,70,0,0.0,30,0,72,0,0,1,0,0,0,1,0,0,0,1
289,44350,2,04/03/2009,26,Normal,8,0,,,,,2,63,,,25.0,1,0,0,0,167,83,57,0,0.0,30,,,0,0,1,0,0,0,0,0,0,0,1
289,44350,3,10/04/2011,56,Normal,8,0,,,,,2,65,,,23.6,1,0,0,0,159,70,55,0,0.0,30,,,0,0,1,0,0,0,0,0,0,0,1
289,44350,4,02/06/2013,72,Normal,8,0,,,,,2,66,,,22.8,1,0,0,0,160,90,52,0,0.0,30,,,0,0,0,0,0,0,0,0,0,0,1
289,44961,1,05/09/2014,0,AD,1,1,,,,,2,75,,,22.5,1,0,0,1,122,80,64,0,7.0,18,0,24,0,0,0,0,0,0,1,0,0,0,0
289,45200,1,04/24/2006,0,FTD,3,0,,,,,1,61,,,30.4,1,0,1,1,113,65,60,,4.5,25,0,24,0,0,0,0,0,0,1,0,0,0,0
289,46754,1,12/12/2014,0,Normal,8,0,,,,,1,73,,,27.3,1,0,1,1,150,70,60,0,0.0,30,0,26,0,0,0,0,0,0,1,0,0,0,0
289,47473,1,08/09/2006,0,Normal,8,0,,,,,2,78,,,27.1,1,0,0,1,138,78,80,0,0.0,30,0,105,0,0,1,1,1,0,1,0,0,0,1
289,47473,3,10/30/2008,26,Normal,8,0,,,,,2,80,,,21.0,1,0,1,0,160,70,72,0,0.0,29,,,0,0,1,1,1,0,0,0,0,0,1
289,47473,4,10/21/2009,38,Normal,8,0,,,,,2,81,,,24.6,1,0,1,0,156,74,78,0,0.0,29,,,0,0,1,1,1,0,0,0,0,0,1
289,47473,5,11/04/2010,51,Normal,8,0,,,,,2,82,,,25.6,1,0,1,0,132,76,64,0,0.0,30,,,0,0,1,1,1,0,0,0,0,0,1
289,47473,6,03/09/2012,67,Normal,8,0,,,,,2,83,,,23.2,1,0,1,0,186,75,67,0,0.0,27,,,0,0,1,1,1,0,0,0,0,0,1
289,47473,7,10/22/2012,74,Normal,8,0,,,,,2,84,,,23.7,1,0,1,0,148,56,64,,0.0,29,,,0,0,1,1,1,0,0,0,0,0,1
289,47473,8,10/03/2013,86,Normal,8,0,,,,,2,85,,,23.7,1,0,1,0,181,76,59,0,0.0,30,,,0,0,1,1,1,0,0,0,0,0,1
289,47606,1,11/19/2012,0,Normal,8,0,,,,,1,77,,,24.8,1,0,0,0,161,86,55,20,0.0,29,0,24,0,0,0,0,0,0,1,0,0,0,1
289,47606,2,10/16/2013,11,Normal,8,0,,,,,1,78,,,25.6,1,0,0,0,128,79,63,20,0.0,30,,,0,0,0,0,0,0,0,0,0,0,1
289,47907,1,07/11/2016,0,FTD,3,0,0,0,1,1,1,74,,,25.2,1,0,1,1,132,74,72,0,5.5,,,,0,0,0,0,0,1,0,0,0,0,0
289,50964,1,10/19/2009,0,AD,1,1,1,0,1,0,1,77,,,29.0,1,0,0,0,133,65,59,0,10.0,10,,,0,0,0,0,0,1,0,0,0,0,0
289,51631,1,11/12/2015,0,AD,1,1,1,0,0,0,2,47,,,22.9,1,0,0,0,130,60,88,15,1.0,,,,0,0,0,0,0,1,0,0,0,0,0
289,52337,1,03/14/2008,0,Normal,8,0,,,,,2,61,,,26.4,1,0,0,0,120,70,66,0,0.0,30,0,104,0,0,1,1,1,0,1,0,0,0,1
289,52337,2,03/31/2009,12,Normal,8,0,,,,,2,62,,,26.4,1,0,0,0,120,80,60,0,0.0,30,,,0,0,1,1,1,0,0,0,0,0,1
289,52337,3,03/09/2011,36,Normal,8,0,,,,,2,64,,,27.3,1,0,0,0,124,60,61,0,0.0,30,,,0,0,1,1,1,0,0,0,0,0,1
289,52337,4,04/05/2012,49,Normal,8,0,,,,,2,65,,,27.9,1,0,0,0,134,65,56,0,0.0,30,,,0,0,1,1,1,0,0,0,0,0,1
289,52337,5,04/30/2013,61,Normal,8,0,,,,,2,66,,,30.0,1,0,0,0,118,68,64,0,0.0,30,,,0,0,1,1,1,0,0,0,0,0,1
289,52413,1,09/14/2015,0,FTD,3,0,0,0,1,0,2,75,,,20.5,1,0,0,0,148,82,80,25,1.0,,,,0,0,0,0,0,1,0,0,0,0,0
289,52999,1,11/26/2007,0,FTD,3,0,,,,,1,69,,,26.5,1,0,1,0,124,77,66,0,8.0,29,0,14,0,0,1,0,0,0,1,0,0,0,1
289,52999,2,01/28/2009,14,FTD,3,0,,,,,1,70,,,28.5,1,0,1,1,121,63,64,0,10.0,27,,,0,0,1,0,0,0,0,0,0,0,1
289,54720,1,08/25/2008,0,FTD,3,0,,,,,1,63,,,33.7,6,0,0,0,136,79,59,0,7.0,30,0,81,0,0,1,0,0,0,1,0,0,0,1
289,54720,2,09/15/2009,13,FTD,3,0,,,,,1,64,,,34.0,6,0,0,0,,,,0,7.0,28,,,0,0,1,0,0,0,0,0,0,0,0
289,54720,3,12/07/2010,28,FTD,3,0,,,,,1,65,,,39.3,6,0,0,0,186,97,60,0,4.5,26,,,0,0,1,0,0,0,0,0,0,0,1
289,57835,1,04/11/2012,0,FTD,3,0,,,,,1,76,,,25.0,1,0,1,1,185,90,59,,6.0,12,0,28,0,0,0,0,0,0,1,0,0,0,0
289,58076,1,06/29/2009,0,FTD,3,0,,,,,1,60,,,,,0,0,0,122,66,64,0,6.0,29,1,35,0,0,0,0,0,0,1,0,0,0,0
289,59326,1,03/29/2006,0,Normal,8,0,,,,,2,65,,,24.3,1,0,0,0,125,80,54,0,0.0,30,0,137,0,0,1,1,1,0,1,0,0,0,1
289,59326,3,01/07/2009,34,Normal,8,0,,,,,2,68,,,25.8,1,0,0,0,130,80,60,0,0.0,29,,,0,0,1,1,1,0,0,0,0,0,1
289,59326,4,03/09/2010,48,Normal,8,0,,,,,2,69,,,24.3,1,0,0,0,126,62,62,0,0.0,30,,,0,0,1,1,1,0,0,0,0,0,1
289,59326,5,03/11/2011,60,Normal,8,0,,,,,2,70,,,24.5,1,0,0,0,130,82,60,0,0.0,30,,,0,0,1,1,1,0,0,0,0,0,1
289,59326,6,04/10/2012,73,Normal,8,0,,,,,2,71,,,26.6,1,0,0,0,143,105,93,0,0.0,30,,,0,0,1,1,1,0,0,0,0,0,1
289,59326,7,03/22/2013,84,Normal,8,0,,,,,2,72,,,26.6,1,0,0,0,132,80,72,0,0.0,30,,,0,0,1,1,1,0,0,0,0,0,1
289,59326,9,01/23/2015,106,Normal,8,0,,,,,2,74,,,27.3,1,0,0,0,138,80,68,0,0.0,29,,,0,0,1,1,1,0,0,0,0,0,1
289,59780,1,09/18/2013,0,FTD,3,0,,,,,1,61,,,,1,0,0,0,145,90,73,0,3.5,26,0,36,0,0,0,0,0,0,1,0,0,0,0
289,59861,1,01/16/2008,0,Normal,8,0,,,,,1,27,,,25.1,1,0,0,0,112,70,70,0,0.0,29,0,86,0,0,0,0,0,0,1,0,0,0,0
289,60510,1,07/28/2010,0,FTD,3,0,,,,,1,64,,,27.3,1,0,1,0,108,69,86,15,3.0,13,1,14,0,0,1,0,0,0,1,0,0,0,0
289,60510,2,08/03/2011,13,FTD,3,0,,,,,1,65,,,24.1,1,0,1,0,107,65,61,15,10.0,,,,0,0,1,0,0,0,0,0,0,0,0
289,60907,1,09/12/2013,0,AD,1,1,,,,,2,69,,,19.0,1,0,1,1,178,74,54,13,2.5,21,0,22,0,0,1,0,0,0,1,0,0,0,1
289,60907,2,09/03/2014,12,AD,1,1,,,,,2,70,,,18.7,1,0,1,1,172,62,56,13,5.5,14,,,0,0,1,0,0,0,0,0,0,0,1
289,61338,1,04/09/2014,0,AD,1,1,,,,,1,59,,,24.9,5,0,1,1,144,70,49,0,4.5,,0,33,0,0,0,0,0,0,1,0,0,0,0
289,61339,1,01/14/2009,0,Normal,8,0,,,,,2,67,,,21.4,1,0,0,0,122,80,66,0,0.5,30,0,103,0,0,1,0,0,0,1,0,0,0,1
289,61339,2,02/24/2014,61,Normal,8,0,,,,,2,72,,,21.9,1,0,0,0,117,62,71,0,0.0,30,,,0,0,1,0,0,0,0,0,0,0,1
289,62195,1,04/29/2011,0,AD,1,1,,,,,2,54,,,21.3,1,0,0,0,106,56,50,0,3.5,28,0,26,0,0,1,0,0,0,1,0,0,0,1
289,62195,2,05/09/2012,13,AD,1,1,,,,,2,55,,,22.7,1,0,0,0,116,72,60,0,3.5,25,,,0,0,1,0,0,0,0,0,0,0,1
289,62195,3,06/05/2013,26,AD,1,1,,,,,2,56,,,22.5,1,0,0,0,94,56,66,0,5.0,24,,,0,0,1,0,0,0,0,0,0,0,1
289,62239,1,06/03/2009,0,Normal,8,0,,,,,2,64,,,23.7,1,0,0,1,122,57,83,0,0.0,30,0,93,0,0,1,1,1,0,1,1,0,0,1
289,62239,2,06/27/2011,24,Normal,8,0,,,,,2,66,,,25.4,1,0,0,1,110,74,80,0,0.0,30,,,0,0,1,1,1,0,0,1,0,0,1
289,62239,3,08/07/2012,38,Normal,8,0,,,,,2,67,,,24.8,1,0,0,1,127,73,80,0,0.0,30,,,0,0,1,1,1,0,0,1,0,0,1
289,62239,4,09/20/2013,51,Normal,8,0,,,,,2,68,,,25.2,1,1,0,1,138,63,80,0,0.0,30,,,0,0,1,1,1,0,0,1,0,0,1
289,62549,1,03/05/2007,0,FTD,3,0,,,,,1,64,,,26.1,1,0,1,1,138,73,64,0,9.5,26,1,39,0,0,1,0,0,0,1,0,0,0,1
289,62549,2,03/03/2008,12,FTD,3,0,,,,,1,65,,,26.6,1,0,0,0,121,61,53,0,15.0,23,,,0,0,1,0,0,0,0,0,0,0,1
289,62701,1,07/14/2016,0,AD,1,1,,,,,1,78,,,,5,1,1,1,,,,25,9.0,,0,11,0,0,0,0,0,0,1,0,0,0,0
289,65389,1,10/30/2006,0,FTD,3,0,0,0,1,0,2,58,,,25.3,1,0,0,1,110,80,100,0,11.0,8,,,0,0,0,0,0,1,0,0,0,0,0
289,66332,1,04/03/2007,0,AD,1,1,1,0,0,0,1,59,,,27.4,1,0,0,0,135,88,84,,13.0,6,,,0,0,0,0,0,1,0,0,0,0,0
289,66350,1,09/08/2016,0,AD,1,1,1,0,0,0,2,72,,,31.5,1,1,0,1,145,77,88,0,1.0,,,,0,0,0,0,0,1,0,0,0,0,0
289,66439,1,03/22/2006,0,Normal,8,0,,,,,2,61,,,25.4,1,0,0,0,145,85,76,0,0.0,30,0,124,0,0,1,1,1,0,1,0,0,0,1
289,66439,3,05/30/2008,26,Normal,8,0,,,,,2,63,,,25.5,1,0,0,0,150,75,72,0,0.0,29,,,0,0,1,1,1,0,0,0,0,0,1
289,66439,4,07/07/2009,40,Normal,8,0,,,,,2,64,,,26.2,1,0,0,0,132,68,83,0,0.0,29,,,0,0,1,1,1,0,0,0,0,0,1
289,66439,6,06/21/2011,63,Normal,8,0,,,,,2,66,,,25.7,1,0,0,0,166,75,76,0,0.0,29,,,0,0,1,1,1,0,0,0,0,0,1
289,66439,8,07/25/2013,88,Normal,8,0,,,,,2,68,,,26.3,1,0,1,0,158,68,63,0,0.0,30,,,0,0,1,1,1,0,0,0,0,0,1
289,66439,9,06/19/2014,99,Normal,8,0,,,,,2,69,,,25.0,1,0,0,0,122,76,72,0,0.0,29,,,0,0,1,1,1,0,0,0,0,0,1
289,67187,1,11/28/2011,0,FTD,3,0,,,,,2,53,,,,1,0,0,0,,,,0,3.0,15,0,30,0,0,0,0,0,0,1,0,0,0,0
289,67570,1,01/22/2014,0,FTD,3,0,,,,,2,77,,,24.0,1,0,0,0,157,67,77,0,0.0,26,0,25,0,0,0,0,0,0,1,0,0,0,0
289,68376,1,09/27/2006,0,Normal,8,0,,,,,2,47,,,,1,0,0,0,,,,0,0.0,30,0,127,0,0,0,0,0,0,1,0,0,0,0
289,68376,3,10/31/2008,25,Normal,8,0,,,,,2,50,,,30.3,1,0,0,0,120,70,60,0,0.0,30,,,0,0,1,0,0,0,0,0,0,0,1
289,68376,5,10/06/2010,49,Normal,8,0,,,,,2,52,,,31.1,1,0,0,0,123,69,73,0,0.0,30,,,0,0,1,0,0,0,0,0,0,0,1
289,68376,6,12/12/2013,87,Normal,8,0,,,,,2,55,,,26.6,1,0,0,0,140,70,64,0,0.0,28,,,0,0,1,0,0,0,0,0,0,0,1
289,69197,1,06/21/2006,0,AD,1,1,,,,,1,58,64,10/15/2011,24.5,1,0,0,0,134,80,93,,5.5,24,1,64,1,0,1,0,0,0,1,0,1,0,1
289,69197,2,05/14/2007,11,AD,1,1,,,,,1,59,,,22.8,1,0,0,0,101,61,83,,6.0,24,,,0,0,1,0,0,0,0,0,0,0,1
289,69197,3,06/16/2008,24,AD,1,1,,,,,1,60,,,21.4,1,0,0,0,101,65,61,,7.0,13,,,0,0,1,0,0,0,0,0,0,0,1
289,69209,1,06/17/2013,0,AD,1,1,,,,,2,59,,,,1,0,0,0,,,,5,3.5,20,0,29,0,0,0,0,0,0,1,0,0,0,0
289,69272,1,01/07/2015,0,FTD,3,0,,,,,2,68,,,,1,0,0,0,120,70,,,1.5,26,0,12,0,0,0,0,0,0,1,0,0,0,0
289,70106,1,01/14/2013,0,FTD,3,0,0,0,1,0,2,52,,,24.1,2,1,0,0,126,75,82,0,6.0,18,,,0,0,0,0,0,1,0,0,0,0,0
289,71820,1,12/02/2015,0,AD,1,1,1,0,0,0,2,70,,,32.3,,0,1,1,160,90,66,0,0.5,29,,,0,0,0,0,0,1,0,0,0,0,0
289,72185,1,07/22/2009,0,Normal,8,0,,,,,2,60,,,19.8,1,0,0,0,130,63,65,0,0.0,30,0,92,0,0,1,1,1,0,1,0,0,0,1
289,72185,2,08/06/2010,13,Normal,8,0,,,,,2,61,,,20.1,1,0,0,1,117,70,72,0,0.0,30,,,0,0,1,1,1,0,0,0,0,0,1
289,72185,3,07/06/2011,24,Normal,8,0,,,,,2,62,,,21.3,1,0,0,0,132,62,81,0,0.0,29,,,0,0,1,1,1,0,0,0,0,0,1
289,72185,4,08/21/2012,37,Normal,8,0,,,,,2,63,,,20.4,1,0,0,1,131,61,65,0,0.0,30,,,0,0,1,1,1,0,0,0,0,0,1
289,72185,5,08/07/2013,49,Normal,8,0,,,,,2,64,,,20.1,1,0,0,0,140,63,58,0,0.0,30,,,0,0,1,1,1,0,0,0,0,0,1
289,72406,1,04/07/2008,0,Normal,8,0,,,,,1,60,,,24.1,1,0,0,1,124,85,64,0,0.0,30,0,26,0,0,1,0,0,0,1,0,0,0,1
289,72406,2,05/01/2009,13,Normal,8,0,,,,,1,61,,,25.7,1,0,0,1,122,79,70,0,0.0,30,,,0,0,1,0,0,0,0,0,0,0,1
289,72406,3,06/30/2010,26,Normal,8,0,,,,,1,62,,,25.6,1,0,0,1,123,82,59,0,0.0,29,,,0,0,1,0,0,0,0,0,0,0,1
289,73844,1,03/22/2006,0,Normal,8,0,,,,,1,67,,,,1,0,0,0,140,75,56,0,0.0,30,0,112,0,0,0,0,0,0,1,0,0,0,0
289,73844,2,04/18/2007,13,Normal,8,0,,,,,1,68,,,23.7,1,0,0,0,130,70,64,0,0.0,30,,,0,0,0,0,0,0,0,0,0,0,1
289,73844,3,07/09/2008,28,Normal,8,0,,,,,1,69,,,24.0,1,0,0,0,135,84,62,0,0.0,30,,,0,0,1,0,0,0,0,0,0,0,1
289,73844,4,02/17/2012,71,Normal,8,0,,,,,1,73,,,24.5,1,0,0,0,134,68,60,0,0.0,30,,,0,0,1,0,0,0,0,0,0,0,1
289,73844,5,08/14/2013,89,Normal,8,0,,,,,1,75,,,25.0,1,0,0,0,169,84,51,0,0.0,29,,,0,0,1,0,0,0,0,0,0,0,1
289,74217,1,03/13/2009,0,FTD,3,0,,,,,1,69,,,29.2,1,0,1,1,,,72,20,4.5,9,0,14,0,0,1,0,0,0,1,0,0,0,0
289,74217,2,05/13/2010,14,FTD,3,0,,,,,1,70,,,29.3,1,0,0,0,118,60,52,20,10.0,,,,0,0,1,0,0,0,0,0,0,0,0
289,76235,1,02/23/2011,0,AD,1,1,1,0,0,0,2,81,,,18.5,1,0,0,0,126,58,60,,8.0,3,,,0,0,0,0,0,1,0,0,0,0,0
289,76873,1,06/12/2009,0,AD,1,1,,,,,2,67,,,23.1,,0,0,0,132,69,62,0,4.0,20,0,37,0,0,0,0,0,0,1,0,0,0,1
289,76873,2,06/09/2010,12,AD,1,1,,,,,2,68,,,25.4,,0,0,0,137,65,61,0,10.0,15,,,0,0,0,0,0,0,0,0,0,0,1
289,77465,1,06/24/2009,0,Normal,8,0,,,,,2,64,,,22.9,1,0,0,1,108,66,77,15,0.0,30,0,91,0,0,1,1,1,0,1,1,0,0,1
289,77465,2,06/11/2010,12,Normal,8,0,,,,,2,65,,,26.7,1,0,0,0,119,63,70,15,0.0,30,,,0,0,1,1,1,0,0,1,0,0,1
289,77465,3,06/16/2011,24,Normal,8,0,,,,,2,66,,,21.6,1,0,0,1,112,60,72,15,0.0,30,,,0,0,1,1,1,0,0,1,0,0,1
289,77465,4,10/19/2012,40,Normal,8,0,,,,,2,67,,,22.9,1,0,0,0,111,64,67,15,0.0,30,,,0,0,1,1,1,0,0,1,0,0,1
289,78942,1,12/16/2009,0,FTD,3,0,,,,,2,61,,,,5,0,0,0,,,,0,5.0,28,0,13,0,0,0,0,0,0,1,0,0,0,0
289,79538,1,10/24/2016,0,FTD,3,0,0,0,1,0,1,65,,,33.0,1,0,1,0,120,60,70,0,4.0,,,,0,0,0,0,0,1,0,0,0,0,0
289,81476,1,04/03/2013,0,FTD,3,0,,,,,1,59,,,30.6,1,1,1,1,135,68,95,25,7.0,30,1,38,0,0,0,0,0,0,1,0,0,0,0
289,83730,1,04/11/2016,0,FTD,3,0,0,0,1,0,2,70,,,21.9,1,0,0,1,130,80,70,20,0.0,,,,0,0,0,0,0,1,0,0,0,0,0
289,85350,1,02/25/2009,0,Normal,8,0,,,,,2,76,,,24.8,1,0,1,1,120,80,78,24,0.5,28,0,17,0,0,1,0,0,0,1,0,0,0,1
289,85350,2,07/02/2010,17,Normal,8,0,,,,,2,78,,,25.9,1,0,1,1,138,76,64,24,0.0,29,,,0,0,1,0,0,0,0,0,0,0,1
289,85380,1,08/15/2016,0,FTD,3,0,0,0,1,0,2,63,,,19.7,1,0,0,0,124,65,72,0,5.0,,,,0,0,0,0,0,1,0,0,0,0,0
289,89206,1,10/15/2008,0,Normal,8,0,,,,,1,64,,,,1,0,0,1,133,85,62,0,0.0,30,0,27,0,0,0,0,0,0,1,0,0,0,0
289,89813,1,07/28/2014,0,FTD,3,0,,,,,1,75,,,23.4,1,0,0,0,148,72,64,0,3.5,25,0,15,0,0,0,0,0,0,1,0,0,0,0
289,90138,1,03/15/2016,0,Normal,8,0,,,,,2,64,,,24.9,,0,1,1,130,70,78,10,0.0,30,0,13,0,0,0,0,0,0,1,0,0,0,1
289,90138,2,04/17/2017,13,Normal,8,0,,,,,2,65,,,23.6,,0,0,0,140,80,70,,0.0,29,,,0,0,0,0,0,0,0,0,0,0,1
289,92295,1,08/28/2006,0,FTD,3,0,,,,,1,63,,,,1,0,0,1,,,,,8.5,29,0,67,0,0,0,0,0,0,1,0,0,0,0
289,92295,3,02/02/2009,30,FTD,3,0,,,,,1,66,,,31.4,1,0,0,1,115,80,72,10,10.0,22,,,0,0,1,0,0,0,0,0,0,0,1
289,92295,4,03/15/2010,43,FTD,3,0,,,,,1,67,,,31.8,1,0,0,1,95,65,84,,16.0,16,,,0,0,1,0,0,0,0,0,0,0,1
289,92295,5,03/19/2012,67,FTD,3,0,,,,,1,69,,,29.1,1,0,0,1,120,66,65,10,14.0,13,,,0,0,1,0,0,0,0,0,0,0,1
289,93729,1,04/09/2007,0,FTD,3,0,0,0,1,0,1,59,,,27.0,1,0,0,0,130,82,52,30,4.0,23,,,0,0,0,0,0,1,0,0,0,0,0
289,94217,1,01/23/2012,0,FTD,3,0,,,,,1,66,,,,1,0,1,0,159,70,56,0,1.0,28,0,38,0,0,0,0,0,0,1,0,0,0,0
289,94217,2,02/06/2013,13,FTD,3,0,,,,,1,67,,,26.3,1,0,0,0,160,67,59,,1.0,,,,0,0,1,0,0,0,0,0,0,0,0
289,94217,3,02/05/2014,25,FTD,3,0,,,,,1,68,,,26.6,1,0,0,0,146,70,68,2,0.5,23,,,0,0,1,0,0,0,0,0,0,0,0
289,95835,1,04/23/2007,0,FTD,3,0,,,,,1,60,,,,1,1,1,1,,,54,0,5.0,26,0,43,0,0,0,0,0,0,1,0,0,0,0
289,96398,1,11/07/2012,0,AD,1,1,,,,,1,56,,,23.3,1,0,0,0,126,85,66,0,2.5,20,0,37,0,0,1,0,0,0,1,0,0,0,1
289,96398,2,12/20/2013,13,AD,1,1,,,,,1,57,,,17.0,1,0,0,0,120,80,70,0,5.5,18,,,0,0,1,0,0,0,0,0,0,0,1
289,96721,1,06/29/2011,0,AD,1,1,,,,,1,61,,,25.9,,0,0,0,111,69,67,0,5.0,25,0,37,0,0,0,0,0,0,1,0,0,0,1
289,96721,2,07/18/2012,13,AD,1,1,,,,,1,62,,,25.6,,0,0,1,118,68,65,0,4.0,19,,,0,0,0,0,0,0,0,0,0,0,1
289,96721,3,09/04/2013,27,AD,1,1,,,,,1,63,,,25.4,,0,0,0,113,69,56,0,3.5,21,,,0,0,0,0,0,0,0,0,0,0,1
289,96721,4,07/30/2014,37,AD,1,1,,,,,1,64,,,23.3,,0,0,1,108,60,78,0,3.5,22,,,0,0,0,0,0,0,0,0,0,0,1
289,96722,1,02/19/2014,0,FTD,3,0,0,0,1,0,1,84,,,23.5,1,0,0,1,135,62,72,0,2.5,26,,,0,0,0,0,0,1,0,0,0,0,0
289,96993,1,04/26/2006,0,Normal,8,0,,,,,2,58,,,,1,0,0,1,,,,0,0.0,30,0,60,0,0,0,0,0,0,1,0,0,0,0
289,96993,2,06/29/2007,14,Normal,8,0,,,,,2,60,,,22.9,1,0,0,1,118,68,60,0,0.0,30,,,0,0,0,0,0,0,0,0,0,0,1
289,96993,3,07/18/2008,27,Normal,8,0,,,,,2,61,,,21.2,1,0,0,1,110,70,52,0,0.0,29,,,0,0,1,1,1,0,0,1,0,0,1
289,96993,4,04/24/2009,36,Normal,8,0,,,,,2,61,,,21.2,1,0,0,1,110,65,54,0,0.0,29,,,0,0,1,1,1,0,0,1,0,0,1
289,96993,5,04/30/2010,48,Normal,8,0,,,,,2,62,,,21.2,1,0,0,0,132,76,60,0,0.0,29,,,0,0,1,1,1,0,0,1,0,0,1
289,96993,6,04/29/2011,60,Normal,8,0,,,,,2,63,,,24.3,1,0,0,1,116,70,58,0,0.0,29,,,0,0,1,1,1,0,0,1,0,0,1
289,99021,1,05/07/2008,0,Normal,8,0,,,,,1,60,,,,1,0,0,0,144,82,56,2,0.0,30,0,36,0,0,0,0,0,0,1,0,0,0,0
289,102831,1,09/10/2013,0,FTD,3,0,0,0,1,0,1,63,,,29.4,1,0,1,1,140,80,56,0,5.5,28,,,0,0,0,0,0,1,0,0,0,0,0
289,102971,1,05/11/2009,0,Normal,8,0,,,,,1,69,,,22.7,1,1,0,1,176,92,75,3,0.0,30,0,12,0,0,1,0,0,0,1,0,0,0,1
289,102971,2,05/03/2010,12,Normal,8,0,,,,,1,70,,,23.1,1,1,0,1,154,92,82,3,0.0,30,,,0,0,1,0,0,0,0,0,0,0,1